{"text_format":"1","workbook":"xlsx","n_sheets":4,"sheets":["Explication","Feuille perso","Carrière-Compétence","Équipement-Titre"],"not_rendered":{"charts":0,"images":0,"macros":1,"external_links":0,"defined_names":17,"comments":0,"pivot_tables":0},"unopened":[],"bounds":{"document_bytes":16777216,"sheet_cells":100000,"rows_first":2000,"rows_last":500,"rows_between":2000,"halvings":0,"cell_chars":16384,"cell_head_chars":4096},"cells_cut":0,"cells_raw":0,"read":"whole","date_system":"1900"}

{"sheet":"Explication","index":0,"n_rows":23,"n_cols":2,"rows_kept":23,"cut":false,"hidden":false,"merged":[]}
[null,"Tout ce qui est en blanc ne peut pas être modifié"]
[]
[null,"Feuille Perso"]
[null,"= Ce que vous avez sur votre feuille"]
[null,"= Qualité de votre équipement"]
[null,"= Inscrivez \"oui\" pour dire que c'est celui que vous avez équipé"]
[null,"= Tout bonus qui modifie le chiffre de base"]
[null,"= Tout bonus qui modifie le chiffre de base en %. Exemple si bonus de 5% inscrire 105%"]
[null,"= Juste le chiffre sans le %. Exemple si +25% critique juste inscrire 25"]
[null,"= Inscriver le bonus de protection innée ou de qualité d'équipement et en bas de la colonne faite le total"]
[]
[null,"Carrière-Compétence"]
[null,"= Inscrire le nombre de point mis dans cette carrière"]
[null,"= Inscrire le terme donné par le Maître de jeu"]
[null,"= Compétence affecté par l'encombrement d'armure"]
[null,"= Point de compétence dépensé par vous"]
[null,"= Point de compétence bonus donné par une carrière"]
[null,"= Point de compétence bonus donné par une carrière pour toute la catégorie"]
[null,"La colonne total vous donne le résultat de tout le calcul incluant votre armure"]
[]
{"$rows_left_out":4}
{"sheet":"Feuille perso","index":1,"n_rows":52,"n_cols":24,"rows_kept":52,"cut":false,"hidden":false,"merged":[[37,16,37,18],[36,5,36,6],[35,10,35,11],[36,10,36,11],[35,7,35,9],[36,7,36,9],[35,5,35,6],[6,0,6,1],[17,2,17,3],[18,2,18,3],[21,2,21,3],[22,2,22,3],[11,2,11,3],[12,2,12,3],[13,2,13,3],[14,2,14,3],[15,2,15,3],[16,2,16,3],[10,0,10,1],[11,0,11,1],[12,0,12,1],[13,0,13,1],[7,0,7,1],[0,0,0,1],[1,0,1,1],[2,0,2,1],[4,0,4,1],[5,0,5,1],[8,0,8,1],[14,0,14,1],[15,0,15,1],[16,0,16,1],[17,0,17,1],[18,0,18,1],[40,0,40,1],[41,0,41,1],[42,0,42,1],[34,0,34,1],[35,0,35,1],[36,0,36,1],[37,0,37,1],[38,0,38,1],[39,0,39,1],[26,0,26,3],[32,2,32,3],[31,2,31,3],[28,2,28,3],[29,2,29,3],[30,2,30,3],[25,2,25,3],[23,2,23,3],[24,2,24,3],[0,4,0,5],[1,4,1,5],[2,4,2,5],[10,2,10,3],[20,2,20,3],[4,2,4,5],[5,2,5,5],[6,2,6,5],[7,2,7,5],[8,2,8,5],[51,0,51,2],[43,0,43,1],[44,0,44,1],[45,0,45,1],[46,0,46,1],[47,0,47,1],[48,0,48,1],[49,0,49,1],[50,0,50,1],[1,13,1,14],[2,13,2,14],[3,13,3,14],[4,13,4,14],[5,13,5,14]]}
["Expérience",null,null,null,"Physique",null,{"$f":"IF($C$7<>0,VLOOKUP($C$7,Carrière_complète,15,FALSE),0)","v":0},null,null,null,null,null,null,"Bonus %",null,"Bonus +"]
["Âge",null,null,null,"Mental",null,{"$f":"IF($C$7<>0,VLOOKUP($C$7,Carrière_complète,16,FALSE),0)","v":0},null,null,"Points de vie",null,null,{"$f":"ROUND((((C1+10)*G1)/10)*N2+P2+5,0)","v":5},1]
["Essence",null,null,null,"Réaction",null,{"$f":"IF($C$7<>0,VLOOKUP($C$7,Carrière_complète,17,FALSE),0)","v":0},null,null,"Points de magie",null,null,{"$f":"IF(G2=0,0,ROUND(G2*VLOOKUP(\"Oui\",A22:N26,14,FALSE)*N3+P3+IF(G2>=6,R3,0),0))","v":0},1,null,null,"M>=6"]
[null,null,null,null,null,null,null,null,null,"Force magique Arcane",null,null,{"$f":"ROUND((C1*G2/40)*N4+1+P4,0)","v":1},1]
["Maison",null,null,null,null,null,"Rang",null,null,"Force magique Divine",null,null,{"$f":"ROUND((C1*G2/40)*N5+1+P5,0)","v":1},1]
["Titre",null,null,null,null,null,"Salaire",{"$f":"IF($C$6=0,0,VLOOKUP($C$6,Titre_Complet,2,FALSE))","v":0},null,"Force magique Maudit",null,null,{"$f":"ROUND((C1*G2/40)*N6+1+P6,0)","v":1},1]
["Carrière",null,null,null,null,null,"Or",null,null,"Champ d'action",null,null,{"$f":"IF(AND(A30=0,A31=0,A32=0,A33=0),6,6+N7+VLOOKUP(\"Oui\",A30:I33,6,FALSE))","v":6}]
["Dogme",null,null,null,null,null,null,null,null,"Vitesse de tour",null,null,{"$f":"14-G3","v":14}]
["Naissance",null,null,null,null,null,null,null,null,"Mouvement",null,null,{"$f":"IF(AND(A22=0,A23=0,A24=0,A25=0,A26=0),6+N9,6-VLOOKUP(\"Oui\",A22:N26,10,FALSE)+N9+VLOOKUP(\"Oui\",A22:N26,11,FALSE))","v":6}]
[]
["Arme",null,"Qualité",null,"Type","Port.","Bonus","Att.","Bonus","Bonus %","Dégâts","Dés","Crit.","Bon.","Mal.","Bon.","Face","Bon.","Flanc","Bon.","Dos","Bon."]
["Aucune",null,null,null,{"$f":"IF(A12=0,0,VLOOKUP(A12,Arme_Complète,9,FALSE))","v":"M / C"},{"$f":"IF(A12=0,0,IF(C12<>0,VLOOKUP(A12,Arme_Complète,2,FALSE)+VLOOKUP(C12,Qualité_Complète,4,FALSE)+G12,VLOOKUP(A12,Arme_Complète,2,FALSE)+G12))","v":1},null,{"$f":"IF(A12=0,0,IF($C12<>0,VLOOKUP($A12,Arme_Complète,3,FALSE)*VLOOKUP($C12,Qualité_Complète,3,FALSE),VLOOKUP($A12,Arme_Complète,3,FALSE)))","v":0},null,1,{"$f":"ROUND(((($C$1+H12+I12)*(20+H12+I12)*$G$1)/1000)*J12+1,0)","v":1},{"$f":"VLOOKUP(K12,Dégat,3,TRUE)","v":1},{"$f":"IF(A12=0,0,IF(C12<>0,VLOOKUP(A12,Arme_Complète,4,FALSE)+VLOOKUP(C12,Qualité_Complète,5,FALSE)+N12,VLOOKUP(A12,Arme_Complète,4,FALSE)+N12))","v":150},null,{"$f":"IF(A12=0,0,VLOOKUP(A12,Arme_Complète,5,FALSE)-$G$2-P12)","v":9},null,{"$f":"IF(A12=0,0,IF(C12<>0,VLOOKUP(A12,Arme_Complète,6,FALSE)-VLOOKUP(C12,Qualité_Complète,6,FALSE)-R12,VLOOKUP(A12,Arme_Complète,6,FALSE)-R12))","v":8},null,{"$f":"IF(A12=0,0,IF(C12<>0,VLOOKUP(A12,Arme_Complète,7,FALSE)-VLOOKUP(C12,Qualité_Complète,7,FALSE)-T12,VLOOKUP(A12,Arme_Complète,7,FALSE)-T12))","v":7},null,{"$f":"IF(A12=0,0,IF(C12<>0,VLOOKUP(A12,Arme_Complète,8,FALSE)-VLOOKUP(C12,Qualité_Complète,8,FALSE)-V12,VLOOKUP(A12,Arme_Complète,8,FALSE)-V12))","v":6}]
[null,null,null,null,0,0,null,0,null,1,1,1,0,null,0,null,0,null,0,null,0]
[null,null,null,null,0,0,null,0,null,1,1,1,0,null,0,null,0,null,0,null,0]
[null,null,null,null,0,0,null,0,null,1,1,1,0,null,0,null,0,null,0,null,0]
[null,null,null,null,0,0,null,0,null,1,1,1,0,null,0,null,0,null,0,null,0]
[null,null,null,null,0,0,null,0,null,1,1,1,0,null,0,null,0,null,0,null,0]
[null,null,null,null,0,0,null,0,null,1,1,1,0,null,0,null,0,null,0,null,0]
[null,null,null,null,0,0,null,0,null,1,1,1,0,null,0,null,0,null,0,null,0]
[]
{"$rows_left_out":33}
{"sheet":"Carrière-Compétence","index":2,"n_rows":139,"n_cols":49,"rows_kept":139,"cut":false,"hidden":false,"merged":[]}
["Page","Nom","# de pex","Password",null,null,"Bonus Catégorie",null,null,null,null,"Bonus Catégorie",null,null,null,null,"Bonus Catégorie",null,null,null,null,"Bonus Catégorie",null,null,null,null,"Bonus Catégorie",null,null,null,null,null,"Nom","Manuelle","Habileté","Sens","Sociale","Connaissance","Choix",null,"Manuelle","Habileté","Sens","Sociale","Connaissance","Choix","P","M","R"]
[null,null,null,null,"Âge",{"$f":"'Feuille perso'!C2","v":0},"Manuelle","Point","Bonus","Malus","Total","Habileté","Point","Bonus","Malus","Total","Sens","Point","Bonus","Malus","Total","Sociale","Point","Bonus","Malus","Total","Connaissance","Point","Bonus","Malus","Total"]
[1,"Barbare",null,null,null,null,"Alcool",null,null,null,{"$f":"H3+I3+J3+$I$1","v":0},"Acrobatie",null,null,{"$f":"IF(AND('Feuille perso'!$B$22=0,'Feuille perso'!$B$23=0,'Feuille perso'!$B$24=0,'Feuille perso'!$B$25=0,'Feuille perso'!$B$26=0),0,VLOOKUP(\"Oui\",'Feuille perso'!$A$22:$N$26,12,FALSE)+VLOOKUP(\"Oui\",'Feuille perso'!$A$22:$N$26,13,FALSE))","v":0},{"$f":"M3+N3+O3+$N$1","v":0},"Analyse",null,null,null,{"$f":"R3+S3+T3+$S$1","v":0},"Baratin",null,null,null,{"$f":"W3+X3+Y3+$X$1","v":0},"Ancien culte",null,null,null,{"$f":"AB3+AC3+AD3+$AC$1","v":0},null,"Barbare",1,1,null,null,null,1,null,{"$f":"AH3*C3","v":0},{"$f":"AI3*C3","v":0},{"$f":"AJ3*C3","v":0},{"$f":"AK3*C3","v":0},{"$f":"AL3*C3","v":0},{"$f":"AM3*C3","v":0},7,2,6]
[2,{"$f":"IF(AND(C3>5,D4=\"Combattant\"),AG4,0)","v":0},null,null,null,null,"Artisanat",null,null,null,{"$f":"H4+I4+J4+$I$1","v":0},"Camouflage nature",null,null,{"$f":"IF(AND('Feuille perso'!$B$22=0,'Feuille perso'!$B$23=0,'Feuille perso'!$B$24=0,'Feuille perso'!$B$25=0,'Feuille perso'!$B$26=0),0,VLOOKUP(\"Oui\",'Feuille perso'!$A$22:$N$26,12,FALSE)+VLOOKUP(\"Oui\",'Feuille perso'!$A$22:$N$26,13,FALSE))","v":0},{"$f":"M4+N4+O4+$N$1","v":0},"Concentration",null,null,{"$f":"IF(AND('Feuille perso'!$B$22=0,'Feuille perso'!$B$23=0,'Feuille perso'!$B$24=0,'Feuille perso'!$B$25=0,'Feuille perso'!$B$26=0),0,VLOOKUP(\"Oui\",'Feuille perso'!$A$22:$N$26,12,FALSE)+VLOOKUP(\"Oui\",'Feuille perso'!$A$22:$N$26,13,FALSE))","v":0},{"$f":"R4+S4+T4+$S$1","v":0},"Corruption",null,null,null,{"$f":"W4+X4+Y4+$X$1","v":0},"Astronomie",null,null,null,{"$f":"AB4+AC4+AD4+$AC$1","v":0},null,"Combattant",1,1,null,null,null,1,null,{"$f":"IF(B4<>0,AH4*C4,0)","v":0},{"$f":"IF(B4<>0,AI4*C4,0)","v":0},{"$f":"IF(B4<>0,AJ4*C4,0)","v":0},{"$f":"IF(B4<>0,AK4*C4,0)","v":0},{"$f":"IF(B4<>0,AL4*C4,0)","v":0},{"$f":"IF(B4<>0,AM4*C4,0)","v":0},8,2,6]
[3,{"$f":"IF(AND(C4>5,D5=\"Gladiateur\",B4<>0),AG5,0)","v":0},null,null,"Manuel",{"$f":"AO139","v":0},"Chapenterie",null,null,null,0,"Camouflage urbain",null,null,{"$f":"IF(AND('Feuille perso'!$B$22=0,'Feuille perso'!$B$23=0,'Feuille perso'!$B$24=0,'Feuille perso'!$B$25=0,'Feuille perso'!$B$26=0),0,VLOOKUP(\"Oui\",'Feuille perso'!$A$22:$N$26,12,FALSE)+VLOOKUP(\"Oui\",'Feuille perso'!$A$22:$N$26,13,FALSE))","v":0},0,"Cuisine",null,null,null,0,"Éloquence",null,null,null,0,"Bibliothèques",null,null,null,0,null,"Gladiateur",1,1,null,null,null,1,null,{"$f":"IF(B5<>0,AH5*C5,0)","v":0},{"$f":"IF(B5<>0,AI5*C5,0)","v":0},{"$f":"IF(B5<>0,AJ5*C5,0)","v":0},{"$f":"IF(B5<>0,AK5*C5,0)","v":0},{"$f":"IF(B5<>0,AL5*C5,0)","v":0},{"$f":"IF(B5<>0,AM5*C5,0)","v":0},8,3,6]
[4,"Milicien",null,null,"Habileté",{"$f":"AP139","v":0},"Chasse et pêche",null,null,{"$f":"IF(AND('Feuille perso'!$B$22=0,'Feuille perso'!$B$23=0,'Feuille perso'!$B$24=0,'Feuille perso'!$B$25=0,'Feuille perso'!$B$26=0),0,VLOOKUP(\"Oui\",'Feuille perso'!$A$22:$N$26,12,FALSE)+VLOOKUP(\"Oui\",'Feuille perso'!$A$22:$N$26,13,FALSE))","v":0},0,"Crochetage",null,null,null,0,"Détection",null,null,null,0,"Empathie",null,null,null,0,"Créatures",null,null,null,0,null,"Milicien",1,null,null,1,null,1,null,{"$f":"AH6*C6","v":0},{"$f":"AI6*C6","v":0},{"$f":"AJ6*C6","v":0},{"$f":"AK6*C6","v":0},{"$f":"AL6*C6","v":0},{"$f":"AM6*C6","v":0},7,3,5]
[5,{"$f":"IF(AND(C6>5,D7=\"Croisé\"),AG7,0)","v":0},null,null,"Sens",{"$f":"AQ139","v":0},"Conduite",null,null,null,0,"Déguisements",null,null,null,0,"Dressage",null,null,null,0,"Faux papiers",null,null,null,0,"Géographie",null,null,null,0,null,"Croisé",1,null,null,1,null,1,null,{"$f":"IF(B7<>0,AH7*C7,0)","v":0},{"$f":"IF(B7<>0,AI7*C7,0)","v":0},{"$f":"IF(B7<>0,AJ7*C7,0)","v":0},{"$f":"IF(B7<>0,AK7*C7,0)","v":0},{"$f":"IF(B7<>0,AL7*C7,0)","v":0},{"$f":"IF(B7<>0,AM7*C7,0)","v":0},7,4,5]
[6,{"$f":"IF(AND(C7>5,D8=\"Templier\",B7<>0),AG8,0)","v":0},null,null,"Social",{"$f":"AR139","v":0},"Cordes",null,null,null,0,"Démolition",null,null,null,0,"Écoute",null,null,null,0,"Hypnotisme",null,null,null,0,"Histoire",null,null,null,0,null,"Templier",1,null,null,1,null,1,null,{"$f":"IF(B8<>0,AH8*C8,0)","v":0},{"$f":"IF(B8<>0,AI8*C8,0)","v":0},{"$f":"IF(B8<>0,AJ8*C8,0)","v":0},{"$f":"IF(B8<>0,AK8*C8,0)","v":0},{"$f":"IF(B8<>0,AL8*C8,0)","v":0},{"$f":"IF(B8<>0,AM8*C8,0)","v":0},8,4,5]
[7,"Écuyer",null,null,"Connaissance",{"$f":"AS139","v":0},"Course",null,null,{"$f":"IF(AND('Feuille perso'!$B$22=0,'Feuille perso'!$B$23=0,'Feuille perso'!$B$24=0,'Feuille perso'!$B$25=0,'Feuille perso'!$B$26=0),0,VLOOKUP(\"Oui\",'Feuille perso'!$A$22:$N$26,12,FALSE)+VLOOKUP(\"Oui\",'Feuille perso'!$A$22:$N$26,13,FALSE))","v":0},0,"Discrétion nature",null,null,{"$f":"IF(AND('Feuille perso'!$B$22=0,'Feuille perso'!$B$23=0,'Feuille perso'!$B$24=0,'Feuille perso'!$B$25=0,'Feuille perso'!$B$26=0),0,VLOOKUP(\"Oui\",'Feuille perso'!$A$22:$N$26,12,FALSE)+VLOOKUP(\"Oui\",'Feuille perso'!$A$22:$N$26,13,FALSE))","v":0},0,"Évaluation",null,null,null,0,"Intimidation",null,null,null,0,"Identification",null,null,null,0,null,"Écuyer",1,null,1,null,1,1,null,{"$f":"AH9*C9","v":0},{"$f":"AI9*C9","v":0},{"$f":"AJ9*C9","v":0},{"$f":"AK9*C9","v":0},{"$f":"AL9*C9","v":0},{"$f":"AM9*C9","v":0},7,4,4]
[8,{"$f":"IF(AND(C9>5,D10=\"Cavalier\"),AG10,0)","v":0},null,null,"Choix",{"$f":"IF(F2<50,F2,50)+AT139","v":0},"Équilibre",null,null,{"$f":"IF(AND('Feuille perso'!$B$22=0,'Feuille perso'!$B$23=0,'Feuille perso'!$B$24=0,'Feuille perso'!$B$25=0,'Feuille perso'!$B$26=0),0,VLOOKUP(\"Oui\",'Feuille perso'!$A$22:$N$26,12,FALSE)+VLOOKUP(\"Oui\",'Feuille perso'!$A$22:$N$26,13,FALSE))","v":0},0,"Discrétion urbaine",null,null,{"$f":"IF(AND('Feuille perso'!$B$22=0,'Feuille perso'!$B$23=0,'Feuille perso'!$B$24=0,'Feuille perso'!$B$25=0,'Feuille perso'!$B$26=0),0,VLOOKUP(\"Oui\",'Feuille perso'!$A$22:$N$26,12,FALSE)+VLOOKUP(\"Oui\",'Feuille perso'!$A$22:$N$26,13,FALSE))","v":0},0,"Lecture labiale",null,null,null,0,"Jargon secret",null,null,null,0,"Maisons",null,null,null,0,null,"Cavalier",1,null,1,null,1,1,null,{"$f":"IF(B10<>0,AH10*C10,0)","v":0},{"$f":"IF(B10<>0,AI10*C10,0)","v":0},{"$f":"IF(B10<>0,AJ10*C10,0)","v":0},{"$f":"IF(B10<>0,AK10*C10,0)","v":0},{"$f":"IF(B10<>0,AL10*C10,0)","v":0},{"$f":"IF(B10<>0,AM10*C10,0)","v":0},7,5,4]
[9,{"$f":"IF(AND(C10>5,D11=\"Chevalier\",B10<>0),AG11,0)","v":0},null,null,null,null,"Équitation",null,null,null,0,"Dissimulation",null,null,null,0,"Météorologie",null,null,null,0,"Jeu",null,null,null,0,"Nature",null,null,null,0,null,"Chevalier",1,null,1,null,1,1,null,{"$f":"IF(B11<>0,AH11*C11,0)","v":0},{"$f":"IF(B11<>0,AI11*C11,0)","v":0},{"$f":"IF(B11<>0,AJ11*C11,0)","v":0},{"$f":"IF(B11<>0,AK11*C11,0)","v":0},{"$f":"IF(B11<>0,AL11*C11,0)","v":0},{"$f":"IF(B11<>0,AM11*C11,0)","v":0},8,5,4]
[10,"Mercenaire",null,null,"Total reçu",{"$f":"SUM(F5:F10)+F21","v":0},"Escalade",null,null,{"$f":"IF(AND('Feuille perso'!$B$22=0,'Feuille perso'!$B$23=0,'Feuille perso'!$B$24=0,'Feuille perso'!$B$25=0,'Feuille perso'!$B$26=0),0,VLOOKUP(\"Oui\",'Feuille perso'!$A$22:$N$26,12,FALSE)+VLOOKUP(\"Oui\",'Feuille perso'!$A$22:$N$26,13,FALSE))","v":0},0,"Médecine",null,null,null,0,"Observation",null,null,null,0,"Leadership",null,null,null,0,"Occultisme",null,null,null,0,null,"Mercenaire",null,1,1,null,null,1,null,{"$f":"AH12*C12","v":0},{"$f":"AI12*C12","v":0},{"$f":"AJ12*C12","v":0},{"$f":"AK12*C12","v":0},{"$f":"AL12*C12","v":0},{"$f":"AM12*C12","v":0},6,3,6]
[11,{"$f":"IF(AND(C12>5,D13=\"Spadassin\"),AG13,0)","v":0},null,null,"Total dépensé",{"$f":"SUM(H21:AB21)","v":0},"Lutte",null,null,{"$f":"IF(AND('Feuille perso'!$B$22=0,'Feuille perso'!$B$23=0,'Feuille perso'!$B$24=0,'Feuille perso'!$B$25=0,'Feuille perso'!$B$26=0),0,VLOOKUP(\"Oui\",'Feuille perso'!$A$22:$N$26,12,FALSE)+VLOOKUP(\"Oui\",'Feuille perso'!$A$22:$N$26,13,FALSE))","v":0},0,"Pièges",null,null,null,0,"Odorat",null,null,null,0,"Marchandage",null,null,null,0,"Politique",null,null,null,0,null,"Spadassin",null,1,1,null,null,1,null,{"$f":"IF(B13<>0,AH13*C13,0)","v":0},{"$f":"IF(B13<>0,AI13*C13,0)","v":0},{"$f":"IF(B13<>0,AJ13*C13,0)","v":0},{"$f":"IF(B13<>0,AK13*C13,0)","v":0},{"$f":"IF(B13<>0,AL13*C13,0)","v":0},{"$f":"IF(B13<>0,AM13*C13,0)","v":0},7,3,6]
[12,{"$f":"IF(AND(C13>5,D14=\"Duelliste\",B13<>0),AG14,0)","v":0},null,null,"Reste",{"$f":"IF(F12-F13<0,0,F12-F13)","v":0},"Métallurgie",null,null,null,0,"Précision",null,null,null,0,"Orientation",null,null,null,0,"Performance",null,null,null,0,"Rituel du Trépas",null,null,null,0,null,"Duelliste",null,1,1,null,null,1,null,{"$f":"IF(B14<>0,AH14*C14,0)","v":0},{"$f":"IF(B14<>0,AI14*C14,0)","v":0},{"$f":"IF(B14<>0,AJ14*C14,0)","v":0},{"$f":"IF(B14<>0,AK14*C14,0)","v":0},{"$f":"IF(B14<>0,AL14*C14,0)","v":0},{"$f":"IF(B14<>0,AM14*C14,0)","v":0},7,3,7]
[13,"Matelot",null,null,"Trop",{"$f":"IF(F13-F12<0,0,F13-F12)","v":0},"Natation",null,null,{"$f":"IF(AND('Feuille perso'!$B$22=0,'Feuille perso'!$B$23=0,'Feuille perso'!$B$24=0,'Feuille perso'!$B$25=0,'Feuille perso'!$B$26=0),0,VLOOKUP(\"Oui\",'Feuille perso'!$A$22:$N$26,12,FALSE)+VLOOKUP(\"Oui\",'Feuille perso'!$A$22:$N$26,13,FALSE))","v":0},0,"Technologie",null,null,null,0,"Perception",null,null,null,0,"Rumeurs",null,null,null,0,"Sortilèges",null,null,null,0,null,"Matelot",1,null,1,1,null,1,null,{"$f":"AH15*C15","v":0},{"$f":"AI15*C15","v":0},{"$f":"AJ15*C15","v":0},{"$f":"AK15*C15","v":0},{"$f":"AL15*C15","v":0},{"$f":"AM15*C15","v":0},6,4,5]
[14,{"$f":"IF(AND(C15>5,D16=\"Marin\"),AG16,0)","v":0},null,null,null,null,"Navigation",null,null,null,0,"Thanatologie",null,null,null,0,"Pistage",null,null,null,0,"Séduction",null,null,null,0,"Tactiques",null,null,null,0,null,"Marin",1,null,1,1,null,1,null,{"$f":"IF(B16<>0,AH16*C16,0)","v":0},{"$f":"IF(B16<>0,AI16*C16,0)","v":0},{"$f":"IF(B16<>0,AJ16*C16,0)","v":0},{"$f":"IF(B16<>0,AK16*C16,0)","v":0},{"$f":"IF(B16<>0,AL16*C16,0)","v":0},{"$f":"IF(B16<>0,AM16*C16,0)","v":0},6,5,5]
[15,{"$f":"IF(AND(C16>5,D17=\"Navigateur\",B16<>0),AG17,0)","v":0},null,null,"# de pex dépensé",{"$f":"AT139","v":0},"Torture",null,null,null,0,"Vol à la tire",null,null,{"$f":"IF(AND('Feuille perso'!$B$22=0,'Feuille perso'!$B$23=0,'Feuille perso'!$B$24=0,'Feuille perso'!$B$25=0,'Feuille perso'!$B$26=0),0,VLOOKUP(\"Oui\",'Feuille perso'!$A$22:$N$26,12,FALSE)+VLOOKUP(\"Oui\",'Feuille perso'!$A$22:$N$26,13,FALSE))","v":0},0,"Recherche",null,null,null,0,"Ventriloquie",null,null,null,0,"Théologie",null,null,null,0,null,"Navigateur",1,null,1,1,null,1,null,{"$f":"IF(B17<>0,AH17*C17,0)","v":0},{"$f":"IF(B17<>0,AI17*C17,0)","v":0},{"$f":"IF(B17<>0,AJ17*C17,0)","v":0},{"$f":"IF(B17<>0,AK17*C17,0)","v":0},{"$f":"IF(B17<>0,AL17*C17,0)","v":0},{"$f":"IF(B17<>0,AM17*C17,0)","v":0},7,5,5]
[16,"Artisan",null,null,"# de pex reçu",{"$f":"'Feuille perso'!C1","v":0},null,null,null,null,0,null,null,null,null,0,null,null,null,null,0,null,null,null,null,0,null,null,null,null,0,null,"Artisan",1,1,null,1,null,1,null,{"$f":"AH18*C18","v":0},{"$f":"AI18*C18","v":0},{"$f":"AJ18*C18","v":0},{"$f":"AK18*C18","v":0},{"$f":"AL18*C18","v":0},{"$f":"AM18*C18","v":0},6,5,4]
[17,{"$f":"IF(AND(C18>5,D19=\"Forgeron\"),AG19,0)","v":0},null,null,"Reste",{"$f":"IF(F18-F17<0,0,F18-F17)","v":0},null,null,null,null,0,null,null,null,null,0,null,null,null,null,0,null,null,null,null,0,null,null,null,null,0,null,"Forgeron",1,1,null,1,null,1,null,{"$f":"IF(B19<>0,AH19*C19,0)","v":0},{"$f":"IF(B19<>0,AI19*C19,0)","v":0},{"$f":"IF(B19<>0,AJ19*C19,0)","v":0},{"$f":"IF(B19<>0,AK19*C19,0)","v":0},{"$f":"IF(B19<>0,AL19*C19,0)","v":0},{"$f":"IF(B19<>0,AM19*C19,0)","v":0},6,6,4]
[18,{"$f":"IF(AND(C19>5,D20=\"Métallurgiste\",B19<>0),AG20,0)","v":0},null,null,"Trop",{"$f":"IF(F17-F18<0,0,F17-F18)","v":0},null,null,null,null,null,null,null,null,null,null,null,null,null,null,null,null,null,null,null,null,null,null,null,null,null,null,"Métallurgiste",1,1,null,1,null,1,null,{"$f":"IF(B20<>0,AH20*C20,0)","v":0},{"$f":"IF(B20<>0,AI20*C20,0)","v":0},{"$f":"IF(B20<>0,AJ20*C20,0)","v":0},{"$f":"IF(B20<>0,AK20*C20,0)","v":0},{"$f":"IF(B20<>0,AL20*C20,0)","v":0},{"$f":"IF(B20<>0,AM20*C20,0)","v":0},6,6,5]
{"$rows_left_out":120}
{"sheet":"Équipement-Titre","index":3,"n_rows":174,"n_cols":26,"rows_kept":174,"cut":false,"hidden":true,"merged":[]}
["Titre","Or",null,"Arme","Portée","Attaque","Critique","Maladresse","Face","Flanc","Dos","Type",null,"Bouclier","Physique","Champ d'action","Face","Flanc","Dos"]
[]
["Adjudant",6,null,"Acier des anges",2,29,300,10,5,3,3,"M / P",null,"Aucun",0,0,0,0,0]
["Amiral",50,null,"Âmes Trahies",1,15,250,9,2,2,2,"M / P",null,"Bouclier improvisé",4,-3,8,10,"-"]
["Archevêque",25,null,"Ange gardien",11,12,200,11,5,4,4,"T / P",null,"Bouclier Tour",7,-4,6,7,9]
["Cadet",2,null,"Arbalète à répétition",7,19,350,10,4,4,4,"T / P",null,"Défense de Richard",6,-3,5,6,9]
["Capitaine",25,null,"Arbalète de concours",7,6,250,10,5,5,5,"T / P",null,"Dragonien",5,-2,5,7,10]
["Caporal",6,null,"Arbalète de siège",8,12,300,10,5,5,5,"T / P",null,"Écu",4,-2,7,8,9]
["Cardinal",40,null,"Arbalète improvisée",5,2,200,10,7,7,6,"T / P",null,"Écu Sormand",6,-3,7,7,8]
["Clerc",7,null,"Arbalète légère",6,3,250,10,7,6,6,"T / P",null,"Garde de Valiant",6,-3,4,6,8]
["Colonel",35,null,"Arbalète lourde",7,7,300,10,6,6,5,"T / P",null,"Grand bouclier",6,-4,7,8,10]
["Commandant",25,null,"Arbalète militaire",6,4,250,10,7,6,6,"T / P",null,"Pavois noble",6,-3,5,8,"-"]
["Commodore",35,null,"Arc ancien",9,9,200,11,6,5,5,"T / P",null,"Petit bouclier",3,-1,8,10,10]
["Diacre",3,null,"Arc court",7,1,150,11,8,6,6,"T / P",null,"Rempart du mage",3,-1,7,9,9]
["Évêque",15,null,"Arc des cieux",11,16,250,11,4,4,3,"T / P",null,"Rondache",5,-2,8,9,9]
["Général",50,null,"Arc franc",8,6,200,11,6,5,4,"T / P",null,"Saint-Norec",7,-4,4,6,9]
["Junior",1,null,"Arc long",9,3,150,11,7,5,5,"T / P",null,"Targe",5,-2,6,9,"-"]
["Lieutenant",12,null,"Arc Primitif",4,0,150,12,9,8,7,"T / P",null,"Valarius",4,-1,5,7,7]
["Lieutenant Major",14,null,"Arme du juste",1,9,150,10,5,4,4,"M / T"]
["Major",17,null,"Arquebuse",5,16,200,12,6,6,5,"T / F",null,"Armures","Perçant","Tranchant","Contondant","Feu","Sortilège","Encombrement mouvement","Encombrement compétence","Magie"]
{"$rows_left_out":154}